
running 1 test
test revision::tests::duplicate_mechanisms ... FAILED

failures:

failures:
    revision::tests::duplicate_mechanisms

test result: FAILED. 0 passed; 1 failed; 0 ignored; 0 measured; 5 filtered out; finished in 0.00s


   Compiling sssp_mutation_gate v0.1.0 (C:\Users\nurdm\OneDrive\Documents\GeodesicLeet_DavisManifold_DavisFieldEquations\sssp_ablation\results\revision\mutation_crate)
warning: unused variable: `skip`
   --> src\revision.rs:309:5
    |
309 |     skip: bool,
    |     ^^^^ help: if this is intentional, prefix it with an underscore: `_skip`
    |
    = note: `#[warn(unused_variables)]` (part of `#[warn(unused)]`) on by default

warning: `sssp_mutation_gate` (lib test) generated 1 warning (run `cargo fix --lib -p sssp_mutation_gate --tests` to apply 1 suggestion)
    Finished `test` profile [unoptimized + debuginfo] target(s) in 1.05s
     Running unittests src\lib.rs (results\revision\mutation_crate\target\debug\deps\sssp_mutation_gate-41a336fcafc0fe00.exe)

thread 'revision::tests::duplicate_mechanisms' (67976) panicked at src\revision.rs:634:9:
assertion failed: ca.vertex_scans > cb.vertex_scans
note: run with `RUST_BACKTRACE=1` environment variable to display a backtrace
error: test failed, to rerun pass `--lib`
